Target
Mitogen-activated protein kinase kinase kinase 5
Ligand
BDBM464069
Substrate
Meas. Tech.
In Vitro Enzyme Activity
IC50
<50±n/a nM
Citation
 Wu, CYu, TLi, NChen, S ASK1 inhibitor and preparation method and use thereof US Patent  US10787435 Publication Date 9/29/2020 
Target
Name:
Mitogen-activated protein kinase kinase kinase 5
Synonyms:
ASK1 MAP3K5 MEKK5
Type:
Protein
Mol. Mass.:
154514.93
Organism:
Homo sapiens (Human)
Description:
Q99683
Residue:
1374
  
Inhibitor
Name:
BDBM464069
Synonyms:
US10787435, Example 047 | WX046
Type:
Small organic molecule
Emp. Form.:
C26H26N8O
Mol. Mass.:
466.5376
SMILES:
Cc1cc2ncn(-c3cccc(n3)-c3nncn3C(C)(C)C)c(=O)c2cc1-n1cnc(c1)C1CC1
: