Target
Cyclin-A2/Cyclin-dependent kinase 2
Ligand
BDBM50110178
Substrate
Meas. Tech.
In Vitro Kinase Assay
IC50
>1000±n/a nM
Citation
 Gray, NZhang, TKwiatkowski, NP Inhibitors of cyclin-dependent kinase 7 (CDK7) US Patent  US10787436 Publication Date 9/29/2020 
Target
Name:
Cyclin-A2/Cyclin-dependent kinase 2
Synonyms:
CDK2-CyclinA CDK2/Cyclin A Cyclin A2/dependent kinase 2 Cyclin-Dependent Kinase 2 (CDK2A)
Type:
Protein Complex
Mol. Mass.:
Description:
Cdk2/Cyclin A kinase was purified from insect cells coinfected with Cyclin A/Cdk2 baculovirus.
Components:
This complex has 2 components.
Component 1
Name:
Cyclin-dependent kinase 2
Synonyms:
CDK2 CDK2_HUMAN Cell division protein kinase 2 Protein cereblon/Cyclin-dependent kinase 2 | p33 protein kinase
Type:
Enzyme Subunit
Mol. Mass.:
33938.17
Organism:
Homo sapiens (Human)
Description:
P24941
Residue:
298
  
Component 2
Name:
Cyclin-A2
Synonyms:
CCN1 CCNA1 CCNA2_HUMAN Cyclin-A
Type:
Enzyme Subunit
Mol. Mass.:
48550.19
Organism:
Homo sapiens (Human)
Description:
P20248
Residue:
432
  
Inhibitor
Name:
BDBM50110178
Synonyms:
CHEMBL3603847 | US10787436, Compound I-23
Type:
Small organic molecule
Emp. Form.:
C31H28ClN7O2
Mol. Mass.:
566.053
SMILES:
CN(C)C\C=C\C(=O)Nc1ccc(cc1)C(=O)Nc1cccc(Nc2ncc(Cl)c(n2)-c2c[nH]c3ccccc23)c1
: