Target
Mitogen-activated protein kinase kinase kinase 11
Ligand
BDBM464110
Substrate
Meas. Tech.
In Vitro Kinase Assay
IC50
<100±n/a nM
Citation
 Gray, NZhang, TKwiatkowski, NP Inhibitors of cyclin-dependent kinase 7 (CDK7) US Patent  US10787436 Publication Date 9/29/2020 
Target
Name:
Mitogen-activated protein kinase kinase kinase 11
Synonyms:
M3K11_HUMAN MLK3 Mixed Lineage Kinase 3 (MLK3) SPRK
Type:
PROTEIN
Mol. Mass.:
92696.93
Organism:
Homo sapiens (Human)
Description:
ChEMBL_1460565
Residue:
847
  
Inhibitor
Name:
BDBM464110
Synonyms:
US10787436, Compound I-53
Type:
Small organic molecule
Emp. Form.:
C32H28N8O2
Mol. Mass.:
556.6171
SMILES:
CN(C)C\C=C\C(=O)Nc1ccc(cc1)C(=O)Nc1cccc(Nc2ncc(C#N)c(n2)-c2c[nH]c3ccccc23)c1
: