Target
Rho-associated protein kinase 2
Ligand
BDBM464222
Substrate
Meas. Tech.
In Vitro Assay
IC50
<3±n/a nM
Citation
 Bhide, RSBodas, MSShirude, PSPatil, SMaishal, TKThiyagarajan, KChinnakotti, KGlunz, PW Spiro-fused cyclic ureas as inhibitors of rock US Patent  US10787450 Publication Date 9/29/2020 
Target
Name:
Rho-associated protein kinase 2
Synonyms:
KIAA0619 ROCK2 Rho kinase 2 (ROCKII) Rho-associated protein kinase 2 (ROCK2) Rho-associated protein kinase 2/Transforming protein RhoA Rho-associated, coiled-coil-containing protein kinase II p164 ROCK-2
Type:
Protein
Mol. Mass.:
160885.43
Organism:
Homo sapiens (Human)
Description:
O75116
Residue:
1388
  
Inhibitor
Name:
BDBM464222
Synonyms:
US10787450, Example 102 | methyl 3-(6-methoxy- 5-(1H-pyrazol-4- yl)pyridin-2-yl)-1-(3- methoxybenzyl)-2- oxo-1,3,8- triazaspiro[4.5]decane- 8-carboxylate
Type:
Small organic molecule
Emp. Form.:
C26H30N6O5
Mol. Mass.:
506.5536
SMILES:
COC(=O)N1CCC2(CN(C(=O)N2Cc2cccc(OC)c2)c2ccc(-c3cn[nH]c3)c(OC)n2)CC1
: