Target
Proto-oncogene tyrosine-protein kinase receptor Ret
Ligand
BDBM370392
Substrate
Meas. Tech.
Inhibitory Activity Assay
IC50
2.20±n/a nM
Citation
 Miyazaki, IShimamura, TKato, MFujita, H Fused pyrimidine compound or salt thereof US Patent  US10787457 Publication Date 9/29/2020 
Target
Name:
Proto-oncogene tyrosine-protein kinase receptor Ret
Synonyms:
CDHF12 Cadherin family member 12 Proto-oncogene c-Ret RET51 Tyrosine-protein kinase Ret (RET)
Type:
Protein
Mol. Mass.:
124318.29
Organism:
Homo sapiens (Human)
Description:
P07949
Residue:
1114
  
Inhibitor
Name:
BDBM370392
Synonyms:
US10233189, Example 24 US11014930, Example 24 | US11236096, Example 24
Type:
Small organic molecule
Emp. Form.:
C18H24N8O
Mol. Mass.:
368.4362
SMILES:
Cc1cc(NC(=O)c2nn(C3CCC(C)(C)CC3)c3ncnc(N)c23)n[nH]1
: