Target
Proto-oncogene tyrosine-protein kinase receptor Ret
Ligand
BDBM370353
Substrate
Meas. Tech.
Inhibitory Activity Assay
IC50
1.53±n/a nM
Citation
 Miyazaki, IShimamura, TKato, MFujita, H Fused pyrimidine compound or salt thereof US Patent  US10787457 Publication Date 9/29/2020 
Target
Name:
Proto-oncogene tyrosine-protein kinase receptor Ret
Synonyms:
CDHF12 Cadherin family member 12 Proto-oncogene c-Ret RET51 Tyrosine-protein kinase Ret (RET)
Type:
Protein
Mol. Mass.:
124318.29
Organism:
Homo sapiens (Human)
Description:
P07949
Residue:
1114
  
Inhibitor
Name:
BDBM370353
Synonyms:
US10233189, Example 39 US11236096, Example 39
Type:
Small organic molecule
Emp. Form.:
C15H20N8O
Mol. Mass.:
328.3723
SMILES:
CCc1cc(NC(=O)c2nn(c3ncnc(N)c23)C(C)(C)C)[nH]n1
: