Target
Proto-oncogene tyrosine-protein kinase receptor Ret
Ligand
BDBM464421
Substrate
Meas. Tech.
Inhibitory Activity Assay
IC50
0.230±n/a nM
Citation
 Miyazaki, IShimamura, TKato, MFujita, H Fused pyrimidine compound or salt thereof US Patent  US10787457 Publication Date 9/29/2020 
Target
Name:
Proto-oncogene tyrosine-protein kinase receptor Ret
Synonyms:
CDHF12 Cadherin family member 12 Proto-oncogene c-Ret RET51 Tyrosine-protein kinase Ret (RET)
Type:
Protein
Mol. Mass.:
124318.29
Organism:
Homo sapiens (Human)
Description:
P07949
Residue:
1114
  
Inhibitor
Name:
BDBM464421
Synonyms:
US10787457, Example 54 US11236096, Example 54
Type:
Small organic molecule
Emp. Form.:
C15H16FN7O
Mol. Mass.:
329.3322
SMILES:
Cc1cc(NC(=O)c2cn(c3ncnc(N)c23)C2(CF)CC2)n[nH]1
: