Target
Proto-oncogene tyrosine-protein kinase receptor Ret
Ligand
BDBM370375
Substrate
Meas. Tech.
Inhibitory Activity Assay
IC50
1.35±n/a nM
Citation
 Miyazaki, IShimamura, TKato, MFujita, H Fused pyrimidine compound or salt thereof US Patent  US10787457 Publication Date 9/29/2020 
Target
Name:
Proto-oncogene tyrosine-protein kinase receptor Ret
Synonyms:
CDHF12 Cadherin family member 12 Proto-oncogene c-Ret RET51 Tyrosine-protein kinase Ret (RET)
Type:
Protein
Mol. Mass.:
124318.29
Organism:
Homo sapiens (Human)
Description:
P07949
Residue:
1114
  
Inhibitor
Name:
BDBM370375
Synonyms:
US10233189, Example 77 US11236096, Example 77
Type:
Small organic molecule
Emp. Form.:
C16H19N7O2
Mol. Mass.:
341.3678
SMILES:
COc1c(C(=O)Nc2cc(C)n[nH]2)c2c(N)ncnc2n1C1(C)CC1
: