Target
Ataxin-1
Ligand
BDBM464378
Substrate
Meas. Tech.
Enzyme Inhibition Assay
IC50
12.0±n/a nM
Citation
 Di Giorgio, PHert, JHunziker, DMattei, PRudolph, MSchmitz, P Bicyclic compounds as ATX inhibitors US Patent  US10787459 Publication Date 9/29/2020 
Target
Name:
Ataxin-1
Synonyms:
ATX1 ATXN1 | SCA1
Type:
Protein
Mol. Mass.:
86941.25
Organism:
Homo sapiens (Human)
Description:
P54253
Residue:
815
  
Inhibitor
Name:
BDBM464378
Synonyms:
US10787459, Example 1.00 US10787459, Example 1.02 US10787459, Example 1.04 US10787459, Example 1.06
Type:
Small organic molecule
Emp. Form.:
C22H19F4N5O4
Mol. Mass.:
493.411
SMILES:
FC(F)(F)Oc1ccc(COC(=O)N2C[C@@H]3CN(C[C@@]3(F)C2)C(=O)c2ccc3[nH]nnc3c2)cc1
: