Target
Prepronociceptin
Ligand
BDBM464436
Substrate
Meas. Tech.
Receptor Binding Assay
Ki
1.90±n/a nM
Citation
 Kuehnert, SKoenigs, RMJakob, FKless, AWegert, ARatcliffe, PJostock, RKoch, TLinz, KSchroeder, W 3-((hetero-)aryl)-8-amino-2-oxo-1,3-diaza-spiro-[4.5]-decane derivatives US Patent  US10793528 Publication Date 10/6/2020 
Target
Name:
Prepronociceptin
Synonyms:
OFQ PNOC_HUMAN
Type:
Protein
Mol. Mass.:
20301.31
Organism:
Human
Description:
Q13519
Residue:
176
  
Inhibitor
Name:
BDBM464436
Synonyms:
US10793528, Example SC_5006
Type:
Small organic molecule
Emp. Form.:
C29H40N6O3
Mol. Mass.:
520.6663
SMILES:
COc1ccc(NC(=O)CCN2C[C@]3(CC[C@@](CC3)(N(C)C)c3ccccc3)N(CC3CCC3)C2=O)nn1
: