Target
Prepronociceptin
Ligand
BDBM464454
Substrate
Meas. Tech.
Receptor Binding Assay
Ki
9.40±n/a nM
Citation
 Kuehnert, SKoenigs, RMJakob, FKless, AWegert, ARatcliffe, PJostock, RKoch, TLinz, KSchroeder, W 3-((hetero-)aryl)-8-amino-2-oxo-1,3-diaza-spiro-[4.5]-decane derivatives US Patent  US10793528 Publication Date 10/6/2020 
Target
Name:
Prepronociceptin
Synonyms:
OFQ PNOC_HUMAN
Type:
Protein
Mol. Mass.:
20301.31
Organism:
Human
Description:
Q13519
Residue:
176
  
Inhibitor
Name:
BDBM464454
Synonyms:
US10793528, Example SC_5024
Type:
Small organic molecule
Emp. Form.:
C28H38N6O4
Mol. Mass.:
522.6391
SMILES:
CN(C)[C@]1(CC[C@]2(CN(CCC(=O)Nc3nccc(O)n3)C(=O)N2CC2(O)CCC2)CC1)c1ccccc1
: