Target
Prepronociceptin
Ligand
BDBM464459
Substrate
Meas. Tech.
Receptor Binding Assay
Ki
205±n/a nM
Citation
 Kuehnert, SKoenigs, RMJakob, FKless, AWegert, ARatcliffe, PJostock, RKoch, TLinz, KSchroeder, W 3-((hetero-)aryl)-8-amino-2-oxo-1,3-diaza-spiro-[4.5]-decane derivatives US Patent  US10793528 Publication Date 10/6/2020 
Target
Name:
Prepronociceptin
Synonyms:
OFQ PNOC_HUMAN
Type:
Protein
Mol. Mass.:
20301.31
Organism:
Human
Description:
Q13519
Residue:
176
  
Inhibitor
Name:
BDBM464459
Synonyms:
US10793528, Example SC_5029
Type:
Small organic molecule
Emp. Form.:
C24H36N4O3
Mol. Mass.:
428.5676
SMILES:
CNC(=O)CCN1C[C@]2(CC[C@@](CC2)(NC)c2ccccc2)N(CC2(O)CCC2)C1=O
: