Target
Prepronociceptin
Ligand
BDBM464498
Substrate
Meas. Tech.
Receptor Binding Assay
Ki
23.0±n/a nM
Citation
 Kuehnert, SKoenigs, RMJakob, FKless, AWegert, ARatcliffe, PJostock, RKoch, TLinz, KSchroeder, W 3-((hetero-)aryl)-8-amino-2-oxo-1,3-diaza-spiro-[4.5]-decane derivatives US Patent  US10793528 Publication Date 10/6/2020 
Target
Name:
Prepronociceptin
Synonyms:
OFQ PNOC_HUMAN
Type:
Protein
Mol. Mass.:
20301.31
Organism:
Human
Description:
Q13519
Residue:
176
  
Inhibitor
Name:
BDBM464498
Synonyms:
US10793528, Example SC_5073
Type:
Small organic molecule
Emp. Form.:
C25H38N4O2
Mol. Mass.:
426.5948
SMILES:
CN(C)[C@]1(CC[C@]2(CN(CC(C)(C)C(N)=O)C(=O)N2CC2CC2)CC1)c1ccccc1
: