Target
Histone-lysine N-methyltransferase EZH2 [Y641F]/Polycomb protein EED/Polycomb protein SUZ12
Ligand
BDBM464528
Substrate
Meas. Tech.
In Vitro Methyltransferase Activity Assay
IC50
5.00±n/a nM
Citation
 Jin, YChen, XCheng, PBu, PZhang, LWen, CLiu, YZhou, FWeng, MLan, J Sulfuryl-substituted benzoheterocyclic derivative, preparation method and medical use thereof US Patent  US10793549 Publication Date 10/6/2020 
Target
Name:
Histone-lysine N-methyltransferase EZH2 [Y641F]/Polycomb protein EED/Polycomb protein SUZ12
Synonyms:
PRC2 (EZH2-Y641F)
Type:
Protein
Mol. Mass.:
Description:
Components:
This complex has 3 components.
Component 1
Name:
Polycomb protein SUZ12
Synonyms:
CHET9 Chromatin precipitated E2F target 9 protein Joined to JAZF1 protein Polycomb protein SUZ12 SUZ12 Suppressor of zeste 12 protein homolog
Type:
Protein
Mol. Mass.:
83080.09
Organism:
Homo sapiens (Human)
Description:
Q15022
Residue:
739
  
Component 2
Name:
Polycomb protein EED
Synonyms:
EED WAIT-1 hEED
Type:
Protein
Mol. Mass.:
50201.68
Organism:
Homo sapiens (Human)
Description:
O75530
Residue:
441
  
Component 3
Name:
Histone-lysine N-methyltransferase EZH2 [Y641F]
Synonyms:
EZH2 EZH2_HUMAN KMT6
Type:
Mol. Mass.:
85351.84
Organism:
Homo sapiens (Human)
Description:
Q15910[Y641F]
Residue:
746
  
Inhibitor
Name:
BDBM464528
Synonyms:
US10793549, Compound G-14
Type:
Small organic molecule
Emp. Form.:
C34H40N6O5S
Mol. Mass.:
644.784
SMILES:
COc1cn(c2cc(cc(C(=O)NCc3c(C)cc(C)[nH]c3=O)c12)-c1ccc(nc1)N1CCN(C)CC1)S(=O)(=O)C1(CC=C)CC1
: