Target
Nociceptin receptor
Ligand
BDBM464585
Substrate
Meas. Tech.
Receptor Binding Assay
Ki
19.0±n/a nM
Citation
 Kuehnert, SKoenigs, RMKless, AWegert, ARatcliffe, PJostock, RKoch, TLinz, KSchroeder, W 8-amino-2-oxo-1,3-diaza-spiro-[4.5]-decane derivatives US Patent  US10793556 Publication Date 10/6/2020 
Target
Name:
Nociceptin receptor
Synonyms:
KOR-3 Mu-type opioid receptor (Mu) Nociceptin Receptor (ORL1 Receptor) Nociceptin receptor (ORL-1) Nociceptin/Orphanin FQ, NOP receptor OPIATE ORL-1 OPRL1 protein ORL1 Opioid receptor like-1 Orphanin FQ receptor (ORL1) | P41146
Type:
G Protein-Coupled Receptor (GPCR)
Mol. Mass.:
40702.87
Organism:
Homo sapiens (Human)
Description:
P41146
Residue:
370
  
Inhibitor
Name:
BDBM464585
Synonyms:
CIS-1-(Cyclobutyl-methyl)-8-dimethylamino-3-[2-[2-[2-[2-(2-methoxy-ethoxy)- ethoxy]-ethoxy]-ethoxy]-ethyl]-8-phenyl-1,3-diazaspiro[4.5]decan-2-one | US10793556, Example SC_4005
Type:
Small organic molecule
Emp. Form.:
C32H53N3O6
Mol. Mass.:
575.7797
SMILES:
COCCOCCOCCOCCOCCN1C[C@]2(CC[C@@](CC2)(N(C)C)c2ccccc2)N(CC2CCC2)C1=O
: