Target
Mu-type opioid receptor
Ligand
BDBM464590
Substrate
Meas. Tech.
Receptor Binding Assay
Ki
87.0±n/a nM
Citation
 Kuehnert, SKoenigs, RMKless, AWegert, ARatcliffe, PJostock, RKoch, TLinz, KSchroeder, W 8-amino-2-oxo-1,3-diaza-spiro-[4.5]-decane derivatives US Patent  US10793556 Publication Date 10/6/2020 
Target
Name:
Mu-type opioid receptor
Synonyms:
M-OR-1 MOR-1 MUOR1 Mu opiate receptor OPRM1 hMOP | mu-type opioid receptor isoform MOR-1
Type:
G Protein-Coupled Receptor (GPCR)
Mol. Mass.:
44789.51
Organism:
Homo sapiens (Human)
Description:
P35372
Residue:
400
  
Inhibitor
Name:
BDBM464590
Synonyms:
CIS-1-(Cyclobutyl-methyl)-8-methylamino-3-(2-methylsulfonyl-ethyl)-8-phenyl- 1,3-diazaspiro[4.5]decan-2-one | US10793556, Example SC_4010
Type:
Small organic molecule
Emp. Form.:
C23H35N3O3S
Mol. Mass.:
433.607
SMILES:
CN[C@]1(CC[C@]2(CN(CCS(C)(=O)=O)C(=O)N2CC2CCC2)CC1)c1ccccc1
: