Target
Tyrosine-protein kinase BTK
Ligand
BDBM465363
Substrate
Meas. Tech.
Kinases Assay
IC50
<10±n/a nM
Citation
 Liao, XLi, JLu, ZZhou, YGao, A Bruton's tyrosine kinase inhibitors US Patent  US10793566 Publication Date 10/6/2020 
Target
Name:
Tyrosine-protein kinase BTK
Synonyms:
AGMX1 Agammaglobulinaemia tyrosine kinase B cell progenitor kinase BPK BTK_HUMAN Tyrosine Kinase BTK Tyrosine-protein kinase BTK (BTK)
Type:
Enzyme
Mol. Mass.:
76289.95
Organism:
Homo sapiens (Human)
Description:
Q06187
Residue:
659
  
Inhibitor
Name:
BDBM465363
Synonyms:
US10793566, Compound 2
Type:
Small organic molecule
Emp. Form.:
C27H25ClN4O3
Mol. Mass.:
488.965
SMILES:
COc1cccc(Oc2ccc(cc2)-c2nn([C@@H]3CCCN(C3)C(=O)C=C)c3ccncc23)c1Cl
: