Target
Tyrosine-protein kinase BTK
Ligand
BDBM444661
Substrate
Meas. Tech.
Kinases Assay
IC50
55±n/a nM
Citation
 Liao, XLi, JLu, ZZhou, YGao, A Bruton's tyrosine kinase inhibitors US Patent  US10793566 Publication Date 10/6/2020 
Target
Name:
Tyrosine-protein kinase BTK
Synonyms:
AGMX1 Agammaglobulinaemia tyrosine kinase B cell progenitor kinase BPK BTK_HUMAN Tyrosine Kinase BTK Tyrosine-protein kinase BTK (BTK)
Type:
Enzyme
Mol. Mass.:
76289.95
Organism:
Homo sapiens (Human)
Description:
Q06187
Residue:
659
  
Inhibitor
Name:
BDBM444661
Synonyms:
(R)-1-(3-(3-(4-((2,3-dihydro-1H-inden-4- yl)oxy)phenyl)-1H-pyrazolo[4,3- c]pyridin-1-yl)pyrrolidin-1-yl)prop-2-en- 1-one US10793566, Compound 31
Type:
Small organic molecule
Emp. Form.:
C28H26N4O2
Mol. Mass.:
450.5316
SMILES:
C=CC(=O)N1CC[C@H](C1)n1nc(-c2ccc(Oc3cccc4CCCc34)cc2)c2cnccc12
: