Target
Tyrosine-protein kinase BTK
Ligand
BDBM444665
Substrate
Meas. Tech.
Kinases Assay
IC50
55±n/a nM
Citation
 Liao, XLi, JLu, ZZhou, YGao, A Bruton's tyrosine kinase inhibitors US Patent  US10793566 Publication Date 10/6/2020 
Target
Name:
Tyrosine-protein kinase BTK
Synonyms:
AGMX1 Agammaglobulinaemia tyrosine kinase B cell progenitor kinase BPK BTK_HUMAN Tyrosine Kinase BTK Tyrosine-protein kinase BTK (BTK)
Type:
Enzyme
Mol. Mass.:
76289.95
Organism:
Homo sapiens (Human)
Description:
Q06187
Residue:
659
  
Inhibitor
Name:
BDBM444665
Synonyms:
(S)-1-(3-(3-(3-chloro-4-phenoxyphenyl)- 1H-pyrazolo[4,3-c]pyridin-1-yl)piperidin- 1-yl)prop-2-en-1-one US10793566, Compound 35
Type:
Small organic molecule
Emp. Form.:
C26H23ClN4O2
Mol. Mass.:
458.939
SMILES:
Clc1cc(ccc1Oc1ccccc1)-c1nn(C2CCCN(C2)C(=O)C=C)c2ccncc12
: