Target
Tyrosine-protein kinase BTK
Ligand
BDBM444683
Substrate
Meas. Tech.
Kinases Assay
IC50
55±n/a nM
Citation
 Liao, XLi, JLu, ZZhou, YGao, A Bruton's tyrosine kinase inhibitors US Patent  US10793566 Publication Date 10/6/2020 
Target
Name:
Tyrosine-protein kinase BTK
Synonyms:
AGMX1 Agammaglobulinaemia tyrosine kinase B cell progenitor kinase BPK BTK_HUMAN Tyrosine Kinase BTK Tyrosine-protein kinase BTK (BTK)
Type:
Enzyme
Mol. Mass.:
76289.95
Organism:
Homo sapiens (Human)
Description:
Q06187
Residue:
659
  
Inhibitor
Name:
BDBM444683
Synonyms:
1-(3-((3-(4-phenoxyphenyl)-1H- pyrazolo[4,3-c]pyridin-1- yl)methyl)piperidin-1-yl)prop-2-en-1-one US10793566, Compound 53
Type:
Small organic molecule
Emp. Form.:
C27H26N4O2
Mol. Mass.:
438.5209
SMILES:
C=CC(=O)N1CCCC(Cn2nc(-c3ccc(Oc4ccccc4)cc3)c3cnccc23)C1
: