Target
Tyrosine-protein kinase BTK
Ligand
BDBM465451
Substrate
Meas. Tech.
Kinases Assay
IC50
55±n/a nM
Citation
 Liao, XLi, JLu, ZZhou, YGao, A Bruton's tyrosine kinase inhibitors US Patent  US10793566 Publication Date 10/6/2020 
Target
Name:
Tyrosine-protein kinase BTK
Synonyms:
AGMX1 Agammaglobulinaemia tyrosine kinase B cell progenitor kinase BPK BTK_HUMAN Tyrosine Kinase BTK Tyrosine-protein kinase BTK (BTK)
Type:
Enzyme
Mol. Mass.:
76289.95
Organism:
Homo sapiens (Human)
Description:
Q06187
Residue:
659
  
Inhibitor
Name:
BDBM465451
Synonyms:
(R,E)-2-(3-(3-(4-(2-fluoro-3- methoxyphenoxy)phenyl)- 7-methoxy-1H-pyrazolo[4,3-c]pyridin-1- yl) piperidine-1-carbonyl)-4,4-dimethylpent- 2-enenitrile | US10793566, Compound 90
Type:
Small organic molecule
Emp. Form.:
C33H34FN5O4
Mol. Mass.:
583.6526
SMILES:
COc1cccc(Oc2ccc(cc2)-c2nn(C3CCCN(C3)C(=O)C(=C\C(C)(C)C)\C#N)c3c(OC)cncc23)c1F
: