Target
Tyrosine-protein kinase BTK
Ligand
BDBM444744
Substrate
Meas. Tech.
Kinases Assay
IC50
5500±n/a nM
Citation
 Liao, XLi, JLu, ZZhou, YGao, A Bruton's tyrosine kinase inhibitors US Patent  US10793566 Publication Date 10/6/2020 
Target
Name:
Tyrosine-protein kinase BTK
Synonyms:
AGMX1 Agammaglobulinaemia tyrosine kinase B cell progenitor kinase BPK BTK_HUMAN Tyrosine Kinase BTK Tyrosine-protein kinase BTK (BTK)
Type:
Enzyme
Mol. Mass.:
76289.95
Organism:
Homo sapiens (Human)
Description:
Q06187
Residue:
659
  
Inhibitor
Name:
BDBM444744
Synonyms:
(R)-1-(3-(3-((4-(4-methylpiperazin-1- yl)phenyl)amino)-1H- pyrazolo[4,3-c]pyridin-1-yl)piperidin-1- yl)prop-2-en-1-one US10793566, Compound 114
Type:
Small organic molecule
Emp. Form.:
C25H31N7O
Mol. Mass.:
445.5599
SMILES:
CN1CCN(CC1)c1ccc(Nc2nn(C3CCCN(C3)C(=O)C=C)c3ccncc23)cc1
: