Target
Tyrosine-protein kinase Lck
Ligand
BDBM50457316
Substrate
Meas. Tech.
Kinases Assay
IC50
5500±n/a nM
Citation
 Liao, XLi, JLu, ZZhou, YGao, A Bruton's tyrosine kinase inhibitors US Patent  US10793566 Publication Date 10/6/2020 
Target
Name:
Tyrosine-protein kinase Lck
Synonyms:
2.7.10.2 LCK_HUMAN Leukocyte C-terminal Src kinase Lymphocyte-specific protein tyrosine kinase Protein YT16 Proto-oncogene tyrosine-protein kinase LCK T cell-specific protein-tyrosine kinase
Type:
Mol. Mass.:
57987.83
Organism:
Homo sapiens (Human)
Description:
P06239
Residue:
509
  
Inhibitor
Name:
BDBM50457316
Synonyms:
CHEMBL4215275 US10793566, Compound 6
Type:
Small organic molecule
Emp. Form.:
C28H27FN4O4
Mol. Mass.:
502.5368
SMILES:
COc1cccc(Oc2ccc(cc2)-c2nn([C@@H]3CCCN(C3)C(=O)C=C)c3c(OC)cncc23)c1F
: