Target
Histone deacetylase 1
Ligand
BDBM465374
Substrate
Meas. Tech.
Enzymatic Assay
IC50
1250±n/a nM
Citation
 Fuller, NOLowe, III, JA Bicyclic inhibitors of histone deacetylase US Patent  US10793567 Publication Date 10/6/2020 
Target
Name:
Histone deacetylase 1
Synonyms:
Cereblon/Histone deacetylase 1 HDAC1 Histone deacetylase 1 (HDAC1) RPD3L1
Type:
Enzyme
Mol. Mass.:
55090.27
Organism:
Homo sapiens (Human)
Description:
Q13547
Residue:
482
  
Inhibitor
Name:
BDBM465374
Synonyms:
US10793567, Compound 8 | US11225479, Compound 8
Type:
Small organic molecule
Emp. Form.:
C20H20N6O
Mol. Mass.:
360.4124
SMILES:
CCc1cc2CN(Cc2cn1)C(=O)Nc1nc(ccc1N)-c1cccnc1
: