Target
Tyrosine-protein kinase BTK
Ligand
BDBM465754
Substrate
Meas. Tech.
Inhibition Activity Assay
IC50
<10±n/a nM
Citation
 Kawahata, WKiyoi, TIrie, TAsami, TSawa, MKashimoto, S Oxoisoquinoline derivatives US Patent  US10793575 Publication Date 10/6/2020 
Target
Name:
Tyrosine-protein kinase BTK
Synonyms:
AGMX1 Agammaglobulinaemia tyrosine kinase B cell progenitor kinase BPK BTK_HUMAN Tyrosine Kinase BTK Tyrosine-protein kinase BTK (BTK)
Type:
Enzyme
Mol. Mass.:
76289.95
Organism:
Homo sapiens (Human)
Description:
Q06187
Residue:
659
  
Inhibitor
Name:
BDBM465754
Synonyms:
2-{3-[2-amino-6- (3-fluorophenyl)- 7H-pyrrolo[2,3- d]pyrimidin-4-yl]- 2-(hydroxy- methyl)phenyl}-6- cyclopropyl- 8-fluoroisoquinolin- 1(2H)-one | US10793575, Example 29
Type:
Small organic molecule
Emp. Form.:
C31H23F2N5O2
Mol. Mass.:
535.5434
SMILES:
Nc1nc(-c2cccc(c2CO)-n2ccc3cc(cc(F)c3c2=O)C2CC2)c2cc([nH]c2n1)-c1cccc(F)c1
: