Target
Tyrosine-protein kinase BTK
Ligand
BDBM468308
Substrate
Meas. Tech.
Inhibition Activity Assay
IC50
0.430±n/a nM
Citation
 Kawahata, WKiyoi, TIrie, TAsami, TSawa, MKashimoto, S Oxoisoquinoline derivatives US Patent  US10793575 Publication Date 10/6/2020 
Target
Name:
Tyrosine-protein kinase BTK
Synonyms:
AGMX1 Agammaglobulinaemia tyrosine kinase B cell progenitor kinase BPK BTK_HUMAN Tyrosine Kinase BTK Tyrosine-protein kinase BTK (BTK)
Type:
Enzyme
Mol. Mass.:
76289.95
Organism:
Homo sapiens (Human)
Description:
Q06187
Residue:
659
  
Inhibitor
Name:
BDBM468308
Synonyms:
2-[3-(2-amino-6-{4- [(diethyl- amino)methyl]phenyl}- 7H-pyrrolo[2,3- d]pyrimidin-4-yl)-2- (hydroxy- methyl)phenyl]-6- cyclopropyl- 8-fluoroisoquinolin- 1(2H)-one | US10793575, Example 52
Type:
Small organic molecule
Emp. Form.:
C36H35FN6O2
Mol. Mass.:
602.7005
SMILES:
CCN(CC)Cc1ccc(cc1)-c1cc2c(nc(N)nc2[nH]1)-c1cccc(c1CO)-n1ccc2cc(cc(F)c2c1=O)C1CC1
: