Target
Tyrosine-protein kinase BTK
Ligand
BDBM465790
Substrate
Meas. Tech.
In Vitro Assay for the Inhibition of BTK Kinase Activity
IC50
3.30±n/a nM
Citation
 Li, YHuang, HLiu, GChen, TRen, JSu, Z Compound used as Bruton's tyrosine kinase inhibitor and preparation method and application thereof US Patent  US10793576 Publication Date 10/6/2020 
Target
Name:
Tyrosine-protein kinase BTK
Synonyms:
AGMX1 Agammaglobulinaemia tyrosine kinase B cell progenitor kinase BPK BTK_HUMAN Tyrosine Kinase BTK Tyrosine-protein kinase BTK (BTK)
Type:
Enzyme
Mol. Mass.:
76289.95
Organism:
Homo sapiens (Human)
Description:
Q06187
Residue:
659
  
Inhibitor
Name:
BDBM465790
Synonyms:
4-(3-((1R,3S,4S)-2-acryloyl-2-azabicyclo[2.2.1]heptan-3-yl)-8-aminoimidazo[1,5-a]pyrazin-1-yl)-N-(pyridin-2-yl)benzamide | US10793576, Example 22
Type:
Small organic molecule
Emp. Form.:
C27H25N7O2
Mol. Mass.:
479.5331
SMILES:
Nc1nccn2c(nc(-c3ccc(cc3)C(=O)Nc3ccccn3)c12)C1[C@H]2CC[C@H](C2)N1C(=O)C=C
: