Target
Tyrosine-protein kinase BTK
Ligand
BDBM465804
Substrate
Meas. Tech.
In Vitro Assay for the Inhibition of BTK Kinase Activity
IC50
93.0±n/a nM
Citation
 Li, YHuang, HLiu, GChen, TRen, JSu, Z Compound used as Bruton's tyrosine kinase inhibitor and preparation method and application thereof US Patent  US10793576 Publication Date 10/6/2020 
Target
Name:
Tyrosine-protein kinase BTK
Synonyms:
AGMX1 Agammaglobulinaemia tyrosine kinase B cell progenitor kinase BPK BTK_HUMAN Tyrosine Kinase BTK Tyrosine-protein kinase BTK (BTK)
Type:
Enzyme
Mol. Mass.:
76289.95
Organism:
Homo sapiens (Human)
Description:
Q06187
Residue:
659
  
Inhibitor
Name:
BDBM465804
Synonyms:
US10793576, Example 36
Type:
Small organic molecule
Emp. Form.:
C29H30N8O2
Mol. Mass.:
522.6009
SMILES:
Nc1nccn2c(nc(-c3ccc(cc3)C(=O)Nc3ccccn3)c12)C1CC2(CN1C(=O)C=C)CCNCC2
: