Target
Tyrosine-protein kinase BTK
Ligand
BDBM465834
Substrate
Meas. Tech.
In Vitro Assay for the Inhibition of BTK Kinase Activity
IC50
34.0±n/a nM
Citation
 Li, YHuang, HLiu, GChen, TRen, JSu, Z Compound used as Bruton's tyrosine kinase inhibitor and preparation method and application thereof US Patent  US10793576 Publication Date 10/6/2020 
Target
Name:
Tyrosine-protein kinase BTK
Synonyms:
AGMX1 Agammaglobulinaemia tyrosine kinase B cell progenitor kinase BPK BTK_HUMAN Tyrosine Kinase BTK Tyrosine-protein kinase BTK (BTK)
Type:
Enzyme
Mol. Mass.:
76289.95
Organism:
Homo sapiens (Human)
Description:
Q06187
Residue:
659
  
Inhibitor
Name:
BDBM465834
Synonyms:
US10793576, Example 66
Type:
Small organic molecule
Emp. Form.:
C27H26N8O2
Mol. Mass.:
494.5477
SMILES:
Cc1ccnc(NC(=O)c2ccc(cc2)-c2nc(C3[C@@H]4CC(CN4)N3C(=O)C=C)n3ccnc(N)c23)c1
: