Target
Tyrosine-protein kinase BTK
Ligand
BDBM465844
Substrate
Meas. Tech.
In Vitro Assay for the Inhibition of BTK Kinase Activity
IC50
46.0±n/a nM
Citation
 Li, YHuang, HLiu, GChen, TRen, JSu, Z Compound used as Bruton's tyrosine kinase inhibitor and preparation method and application thereof US Patent  US10793576 Publication Date 10/6/2020 
Target
Name:
Tyrosine-protein kinase BTK
Synonyms:
AGMX1 Agammaglobulinaemia tyrosine kinase B cell progenitor kinase BPK BTK_HUMAN Tyrosine Kinase BTK Tyrosine-protein kinase BTK (BTK)
Type:
Enzyme
Mol. Mass.:
76289.95
Organism:
Homo sapiens (Human)
Description:
Q06187
Residue:
659
  
Inhibitor
Name:
BDBM465844
Synonyms:
US10793576, Example 76
Type:
Small organic molecule
Emp. Form.:
C31H31N5O2
Mol. Mass.:
505.6101
SMILES:
CC#CC(=O)N1C[C@H]2[C@@H]([C@H]1c1nc(-c3ccc(cc3)C(C)(O)c3ccccc3)c3c(N)nccn13)C2(C)C
: