Target
cAMP-specific 3',5'-cyclic phosphodiesterase 4D
Ligand
BDBM465945
Substrate
Meas. Tech.
PDE4 Assay
IC50
<100±n/a nM
Citation
 Liang, XLarsen, J Substituted pyrazoloazepin-8-ones and their use as phosphodiesterase inhibitors US Patent  US10793580 Publication Date 10/6/2020 
Target
Name:
cAMP-specific 3',5'-cyclic phosphodiesterase 4D
Synonyms:
3',5'-cyclic phosphodiesterase PDE43 PDE4D_HUMAN | Phosphodiesterase 4D
Type:
Protein
Mol. Mass.:
91092.69
Organism:
Homo sapiens (Human)
Description:
Q08499
Residue:
809
  
Inhibitor
Name:
BDBM465945
Synonyms:
3-(1-ethyl-8-oxo-spiro[6,7- dihydro-4H-pyrazolo[3,4- c]azepine-5,4'- tetrahydropyran]-3-yl)propyl 4-chloro-3-fluoro-benzoate | US10793580, Example 48
Type:
Small organic molecule
Emp. Form.:
C23H27ClFN3O4
Mol. Mass.:
463.93
SMILES:
CCn1nc(CCCOC(=O)c2ccc(Cl)c(F)c2)c2CC3(CCOCC3)CNC(=O)c12
: