Target
cAMP-specific 3',5'-cyclic phosphodiesterase 4D
Ligand
BDBM466122
Substrate
Meas. Tech.
PDE4 Assay
IC50
<100±n/a nM
Citation
 Liang, XLarsen, J Substituted pyrazoloazepin-8-ones and their use as phosphodiesterase inhibitors US Patent  US10793580 Publication Date 10/6/2020 
Target
Name:
cAMP-specific 3',5'-cyclic phosphodiesterase 4D
Synonyms:
3',5'-cyclic phosphodiesterase PDE43 PDE4D_HUMAN | Phosphodiesterase 4D
Type:
Protein
Mol. Mass.:
91092.69
Organism:
Homo sapiens (Human)
Description:
Q08499
Residue:
809
  
Inhibitor
Name:
BDBM466122
Synonyms:
US10793580, Example 222 | [3-(1-ethyl-8-oxo-spiro[6,7- dihydro-4H-pyrazolo[3,4- c]azepine-5,4'-tetrahydro- pyran]-3-yl)-2,2-dimethyl- propyl] 4-(piperidine-1- carbonyl)benzoate
Type:
Small organic molecule
Emp. Form.:
C31H42N4O5
Mol. Mass.:
550.689
SMILES:
CCn1nc(CC(C)(C)COC(=O)c2ccc(cc2)C(=O)N2CCCCC2)c2CC3(CCOCC3)CNC(=O)c12
: