Target
Kynurenine/alpha-aminoadipate aminotransferase, mitochondrial
Ligand
BDBM466263
Substrate
Meas. Tech.
Inhibitory Assay
IC50
130±n/a nM
Citation
 Okuyama, MFukunaga, KUsui, KHayashi, NIijima, DHoriuchi, HFujimoto, N Bicyclic heterocyclic compound US Patent  US10793582 Publication Date 10/6/2020 
Target
Name:
Kynurenine/alpha-aminoadipate aminotransferase, mitochondrial
Synonyms:
2-aminoadipate aminotransferase AADAT Alpha-aminoadipate aminotransferase KAT2 Kynurenine aminotransferase II Kynurenine--oxoglutarate aminotransferase II Kynurenine--oxoglutarate transaminase II
Type:
Enzyme
Mol. Mass.:
47353.09
Organism:
Homo sapiens (Human)
Description:
Q8N5Z0
Residue:
425
  
Inhibitor
Name:
BDBM466263
Synonyms:
US10793582, Example 90
Type:
Small organic molecule
Emp. Form.:
C22H25N5O3S
Mol. Mass.:
439.531
SMILES:
O=C(NCc1ccccc1)[C@H]1CCCN1c1nc2ncnc(OC3CCOCC3)c2s1
: