Target
Genome polyprotein [1973-2419]
Ligand
BDBM466319
Substrate
Meas. Tech.
Inhibition Assay
IC50
<1000±n/a nM
Citation
 Beigelman, LWang, GSmith, DB Substituted nucleosides, nucleotides and analogs thereof US Patent  US10793591 Publication Date 10/6/2020 
Target
Name:
Genome polyprotein [1973-2419]
Synonyms:
Non-structural protein 5A (NS5A) RNA-directed RNA polymerase (NS5B)
Type:
Enzyme Catalytic Domain
Mol. Mass.:
48705.67
Organism:
Hepatitis C virus genotype 1b (isolate Con1) (HCV)
Description:
Q9WMX2[1973-2419]
Residue:
447
  
Inhibitor
Name:
BDBM466319
Synonyms:
US10793591, Compound 44
Type:
Small organic molecule
Emp. Form.:
C12H14F2N5O13P3
Mol. Mass.:
567.1834
SMILES:
Nc1nc2n(cnc2c(=O)[nH]1)[C@@H]1O[C@](F)(COP(O)(=O)OP(O)(=O)OP(O)(O)=O)[C@@H](O)[C@]1(F)C#C
: