Target
Non-receptor tyrosine-protein kinase TYK2
Ligand
BDBM466373
Substrate
Meas. Tech.
JAK Kinase Assays
EC50
63.7±n/a nM
Citation
 Larsen, MRitzen, ANørremark, BGreve, DR 5-(7H-pyrrolo[2,3-d]pyrimidin-4-yl)-5-azaspiro[2.5]octane-8-carboxylic acid derivatives as novel JAK kinase inhibitors US Patent  US10799507 Publication Date 10/13/2020 
Target
Name:
Non-receptor tyrosine-protein kinase TYK2
Synonyms:
Non-receptor tyrosine-protein kinase TYK2 (TYK2) TYK2_HUMAN | Tyrosine-protein kinase TYK2
Type:
Protein
Mol. Mass.:
133666.03
Organism:
Homo sapiens (Human)
Description:
P29597
Residue:
1187
  
Inhibitor
Name:
BDBM466373
Synonyms:
(8S)-N-[(4-cyano- 2-fluoro- phenyl)methyl]-5- (7H-pyrrolo[2,3- d]pyrimidin-4-yl)- 5-azaspiro [2.5]octane- 8-carboxamide | US10799507, Example 31
Type:
Small organic molecule
Emp. Form.:
C22H21FN6O
Mol. Mass.:
404.4401
SMILES:
Fc1cc(ccc1CNC(=O)[C@H]1CCN(CC11CC1)c1ncnc2[nH]ccc12)C#N
: