Target
Tyrosine-protein kinase JAK3
Ligand
BDBM466403
Substrate
Meas. Tech.
JAK Kinase Assays
EC50
15.7±n/a nM
Citation
 Larsen, MRitzen, ANørremark, BGreve, DR 5-(7H-pyrrolo[2,3-d]pyrimidin-4-yl)-5-azaspiro[2.5]octane-8-carboxylic acid derivatives as novel JAK kinase inhibitors US Patent  US10799507 Publication Date 10/13/2020 
Target
Name:
Tyrosine-protein kinase JAK3
Synonyms:
JAK-3 JAK3_HUMAN Janus kinase 3 (JAK3) L-JAK | Leukocyte janus kinase
Type:
Protein
Mol. Mass.:
125111.08
Organism:
Homo sapiens (Human)
Description:
P52333
Residue:
1124
  
Inhibitor
Name:
BDBM466403
Synonyms:
(8S)-N-[(3,3- difluorocyclobutyl) methyl]-5-(7H- pyrrolo[2,3- d]pyrimidin-4-yl)- 5-azaspiro [2.5]octane- 8-carboxamide | US10799507, Example 62
Type:
Small organic molecule
Emp. Form.:
C19H23F2N5O
Mol. Mass.:
375.4156
SMILES:
FC1(F)CC(CNC(=O)[C@H]2CCN(CC22CC2)c2ncnc3[nH]ccc23)C1
: