Target
Neurotensin receptor type 1
Ligand
BDBM466499
Substrate
Meas. Tech.
Functional Ca2+ Mobilisation Assay
IC50
7.54±n/a nM
Citation
 Osterkamp, FHaase, CReineke, USmerling, CPaschke, MUngewiß, J Conjugate comprising a neurotensin receptor ligand and use thereof US Patent  US10799605 Publication Date 10/13/2020 
Target
Name:
Neurotensin receptor type 1
Synonyms:
Dopamine receptor D2L/neurotensin receptor NTS1 NTRR Neurotensin receptor 1 | neurotensin receptor type 1
Type:
PROTEIN
Mol. Mass.:
46278.89
Organism:
Homo sapiens (Human)
Description:
ChEMBL_1453811
Residue:
418
  
Inhibitor
Name:
BDBM466499
Synonyms:
US10799605, Example 4
Type:
Small organic molecule
Emp. Form.:
C51H72N6O9
Mol. Mass.:
913.1522
SMILES:
COc1cccc(OC)c1-c1cc(nn1-c1ccc(cc1C(C)C)C(=O)N(C)CCCN(C)CCCN(C)C(=O)CCCC(O)=O)C(=O)NC1(C2CC3CC(C2)CC1C3)C(=O)OC(C)(C)C
: