Target
Poly [ADP-ribose] polymerase 2
Ligand
BDBM50110808
Substrate
Meas. Tech.
Biochemical Assay
Kd
6800±n/a nM
Citation
 Papeo, GMKrasavin, MYOrsini, PScolaro, A 4-carboxamido-isoindolinone derivatives as selective PARP-1 inhibitors US Patent  US10800739 Publication Date 10/13/2020 
Target
Name:
Poly [ADP-ribose] polymerase 2
Synonyms:
(ARTD2 or PARP2) ADPRTL2 PARP2_HUMAN Poly [ADP-ribose] polymerase 2 (PARP2)
Type:
Enzyme
Mol. Mass.:
66225.70
Organism:
Homo sapiens (Human)
Description:
Q9UGN5
Residue:
583
  
Inhibitor
Name:
BDBM50110808
Synonyms:
CHEMBL3606007 US11420940, cpd (10)
Type:
Small organic molecule
Emp. Form.:
C20H22N4O2
Mol. Mass.:
350.4143
SMILES:
NC(=O)c1cccc2CN(C3CCN(Cc4cccnc4)CC3)C(=O)c12
: