Target
Short transient receptor potential channel 6
Ligand
BDBM466596
Substrate
Meas. Tech.
High Throughput Screening Assay
IC50
27.0±n/a nM
Citation
 Bouyssou, TGottschling, DHeine, NKeenan, LLLowe, MDRazavi, HSarko, CRSurprenant, STakahashi, HTurner, MRWu, X Inhibitors of TRPC6 US Patent  US10800757 Publication Date 10/13/2020 
Target
Name:
Short transient receptor potential channel 6
Synonyms:
TRP-6 TRPC6 Transient receptor protein 6
Type:
PROTEIN
Mol. Mass.:
106326.67
Organism:
Homo sapiens (Human)
Description:
ChEMBL_107640
Residue:
931
  
Inhibitor
Name:
BDBM466596
Synonyms:
US10800757, Compound 12 [4-(6-Amino-pyridin-3-yl)-piperazin- 1-yl]-[4-methoxy-5-(4-methoxy- phenoxy)-pyridin-2-yl]-methanone
Type:
Small organic molecule
Emp. Form.:
C23H25N5O4
Mol. Mass.:
435.4757
SMILES:
COc1ccc(Oc2cnc(cc2OC)C(=O)N2CCN(CC2)c2ccc(N)nc2)cc1
: