Target
Short transient receptor potential channel 6
Ligand
BDBM466665
Substrate
Meas. Tech.
High Throughput Screening Assay
IC50
<27.0±n/a nM
Citation
 Bouyssou, TGottschling, DHeine, NKeenan, LLLowe, MDRazavi, HSarko, CRSurprenant, STakahashi, HTurner, MRWu, X Inhibitors of TRPC6 US Patent  US10800757 Publication Date 10/13/2020 
Target
Name:
Short transient receptor potential channel 6
Synonyms:
TRP-6 TRPC6 Transient receptor protein 6
Type:
PROTEIN
Mol. Mass.:
106326.67
Organism:
Homo sapiens (Human)
Description:
ChEMBL_107640
Residue:
931
  
Inhibitor
Name:
BDBM466665
Synonyms:
US10800757, Compound 80 [4-(6-Amino-pyridazin-3-yl)-piperidin- 1-yl]-[4-methoxy-5-(4- trifluoromethoxy-phenoxy)-pyridin-2- yl]-methanone
Type:
Small organic molecule
Emp. Form.:
C23H22F3N5O4
Mol. Mass.:
489.4471
SMILES:
COc1cc(ncc1Oc1ccc(OC(F)(F)F)cc1)C(=O)N1CCC(CC1)c1ccc(N)nn1
: