Target
Mitogen-activated protein kinase kinase kinase kinase 1
Ligand
BDBM466689
Substrate
Meas. Tech.
HPK1 Kinase Binding Assay
Ki
2750±n/a nM
Citation
 Vechorkin, OPan, JSokolsky, AStyduhar, EYao, W Carboxamide compounds and uses thereof US Patent  US10800761 Publication Date 10/13/2020 
Target
Name:
Mitogen-activated protein kinase kinase kinase kinase 1
Synonyms:
HPK1 MAP4K1
Type:
PROTEIN
Mol. Mass.:
91316.07
Organism:
Homo sapiens (Human)
Description:
ChEMBL_586597
Residue:
833
  
Inhibitor
Name:
BDBM466689
Synonyms:
US10800761, Example 8 | US11731958, Example 8
Type:
Small organic molecule
Emp. Form.:
C27H23F2N5O2
Mol. Mass.:
487.5006
SMILES:
COc1cccc(F)c1-c1nccc(n1)C(=O)Nc1cc(F)ccc1N1CCCC1c1ccccn1
: