Target
Mitogen-activated protein kinase kinase kinase kinase 1
Ligand
BDBM466709
Substrate
Meas. Tech.
HPK1 Kinase Binding Assay
Ki
<100±n/a nM
Citation
 Vechorkin, OPan, JSokolsky, AStyduhar, EYao, W Carboxamide compounds and uses thereof US Patent  US10800761 Publication Date 10/13/2020 
Target
Name:
Mitogen-activated protein kinase kinase kinase kinase 1
Synonyms:
HPK1 MAP4K1
Type:
PROTEIN
Mol. Mass.:
91316.07
Organism:
Homo sapiens (Human)
Description:
ChEMBL_586597
Residue:
833
  
Inhibitor
Name:
BDBM466709
Synonyms:
US10800761, Example 28
Type:
Small organic molecule
Emp. Form.:
C27H28F2N6O3
Mol. Mass.:
522.5464
SMILES:
COc1cccc(F)c1-c1nccc(n1)C(=O)Nc1cc(F)c(cc1N1C[C@@H]2C[C@H]1CN2)N1CCOCC1
: