Target
Mitogen-activated protein kinase kinase kinase kinase 1
Ligand
BDBM466773
Substrate
Meas. Tech.
HPK1 Kinase Binding Assay
Ki
<100±n/a nM
Citation
 Vechorkin, OPan, JSokolsky, AStyduhar, EYao, W Carboxamide compounds and uses thereof US Patent  US10800761 Publication Date 10/13/2020 
Target
Name:
Mitogen-activated protein kinase kinase kinase kinase 1
Synonyms:
HPK1 MAP4K1
Type:
PROTEIN
Mol. Mass.:
91316.07
Organism:
Homo sapiens (Human)
Description:
ChEMBL_586597
Residue:
833
  
Inhibitor
Name:
BDBM466773
Synonyms:
US10800761, Example 92 | US11731958, Example 92
Type:
Small organic molecule
Emp. Form.:
C23H23F2N5O3
Mol. Mass.:
455.4572
SMILES:
COc1cccc(F)c1-c1nccc(n1)C(=O)Nc1ccc(F)cc1N1C[C@@H](N)C[C@H]1CO
: