Target
Serine/threonine-protein kinase Chk1
Ligand
BDBM466912
Substrate
Meas. Tech.
pCHK1 Cellular Assay
IC50
97.0±n/a nM
Citation
 Di Francesco, MEJones, PCarroll, CLCross, JBKang, ZJohnson, MGLively, S Heterocyclic inhibitors of ATR kinase US Patent  US10800774 Publication Date 10/13/2020 
Target
Name:
Serine/threonine-protein kinase Chk1
Synonyms:
CHEK1 CHK1 checkpoint homolog Checkpoint kinase-1 (CHK1)
Type:
Enzyme Catalytic Domain
Mol. Mass.:
54443.02
Organism:
Homo sapiens (Human)
Description:
gi_166295192
Residue:
476
  
Inhibitor
Name:
BDBM466912
Synonyms:
(3R)-4-[6-(1-Methane- sulfonylpyrrolidin-3-yl)-2- {1H-pyrrolo[2,3-b]pyridin-4- yl}pyrimidin-4-yl]-3- methylmorpholine | US10800774, Example 11
Type:
Small organic molecule
Emp. Form.:
C21H26N6O3S
Mol. Mass.:
442.535
SMILES:
C[C@@H]1COCCN1c1cc(nc(n1)-c1ccnc2[nH]ccc12)C1CCN(C1)S(C)(=O)=O
: