Target
Serine/threonine-protein kinase Chk1
Ligand
BDBM466922
Substrate
Meas. Tech.
pCHK1 Cellular Assay
IC50
82.0±n/a nM
Citation
 Di Francesco, MEJones, PCarroll, CLCross, JBKang, ZJohnson, MGLively, S Heterocyclic inhibitors of ATR kinase US Patent  US10800774 Publication Date 10/13/2020 
Target
Name:
Serine/threonine-protein kinase Chk1
Synonyms:
CHEK1 CHK1 checkpoint homolog Checkpoint kinase-1 (CHK1)
Type:
Enzyme Catalytic Domain
Mol. Mass.:
54443.02
Organism:
Homo sapiens (Human)
Description:
gi_166295192
Residue:
476
  
Inhibitor
Name:
BDBM466922
Synonyms:
(3R)-4-[6-(1- Cyclopropanecarbonylpiperidin- 4-yl)-2-{1H-pyrrolo[2,3- b]pyridin-4-yl}pyrimidin-4- yl]-3-methylmorpholine | US10800774, Example 21
Type:
Small organic molecule
Emp. Form.:
C25H30N6O2
Mol. Mass.:
446.5447
SMILES:
C[C@@H]1COCCN1c1cc(nc(n1)-c1ccnc2[nH]ccc12)C1CCN(CC1)C(=O)C1CC1
: