Target
ATR-interacting protein/Serine/threonine-protein kinase ATR
Ligand
BDBM466919
Substrate
Meas. Tech.
ATR/ATRIP Enzymatic Assay
IC50
14.0±n/a nM
Citation
 Di Francesco, MEJones, PCarroll, CLCross, JBKang, ZJohnson, MGLively, S Heterocyclic inhibitors of ATR kinase US Patent  US10800774 Publication Date 10/13/2020 
Target
Name:
ATR-interacting protein/Serine/threonine-protein kinase ATR
Synonyms:
ATR/ATRIP
Type:
Enzyme
Mol. Mass.:
Description:
Components:
This complex has 2 components.
Component 1
Name:
Serine/threonine-protein kinase ATR
Synonyms:
ATR Ataxia telangiectasia and Rad3-related protein (ATR) FRP1 | Serine-protein kinase ATR
Type:
Protein
Mol. Mass.:
301404.58
Organism:
Homo sapiens (Human)
Description:
Q13535
Residue:
2644
  
Component 2
Name:
ATR-interacting protein
Synonyms:
AGS1 ATR-interacting protein (ATRIP) ATRIP_HUMAN
Type:
Enzyme Catalytic Domain
Mol. Mass.:
85833.30
Organism:
Homo sapiens (Human)
Description:
Q8WXE1
Residue:
791
  
Inhibitor
Name:
BDBM466919
Synonyms:
N-methyl-3-{6-[(3R)-3- methylmorpholin-4-yl]-2- {1H-pyrrolo[2,3-b]pyridin-4- yl}pyrimidin-4-yl}- pyrrolidine-1-carboxamide | US10800774, Example 18
Type:
Small organic molecule
Emp. Form.:
C22H27N7O2
Mol. Mass.:
421.4955
SMILES:
CNC(=O)N1CCC(C1)c1cc(nc(n1)-c1ccnc2[nH]ccc12)N1CCOC[C@H]1C
: