Target
Metabotropic glutamate receptor 2
Ligand
BDBM466943
Substrate
Meas. Tech.
In Vitro Activity Test for mGluR2
EC50
381±n/a nM
Citation
 Liu, HZhou, YXia, WZhang, DJiang, HChen, K Fluorine-containing triazolopyridine, and manufacturing method, pharmaceutical composition, and application thereof US Patent  US10800776 Publication Date 10/13/2020 
Target
Name:
Metabotropic glutamate receptor 2
Synonyms:
GPRC1B GRM2_HUMAN Metabotropic glutamate receptor mGlu2 | metabotropic glutamate 2
Type:
Enzyme
Mol. Mass.:
95584.88
Organism:
Homo sapiens (Human)
Description:
Q14416
Residue:
872
  
Inhibitor
Name:
BDBM466943
Synonyms:
3-((2,2-difluorocyclopropyl)methyl)- 7-(4-fluorophenyl)-[1,2,4]triazole [4,3-a]pyridine | US10800776, Example 13
Type:
Small organic molecule
Emp. Form.:
C16H12F3N3
Mol. Mass.:
303.2818
SMILES:
Fc1ccc(cc1)-c1ccn2c(CC3CC3(F)F)nnc2c1
: