Target
Metabotropic glutamate receptor 2
Ligand
BDBM466955
Substrate
Meas. Tech.
In Vitro Activity Test for mGluR2
EC50
856±n/a nM
Citation
 Liu, HZhou, YXia, WZhang, DJiang, HChen, K Fluorine-containing triazolopyridine, and manufacturing method, pharmaceutical composition, and application thereof US Patent  US10800776 Publication Date 10/13/2020 
Target
Name:
Metabotropic glutamate receptor 2
Synonyms:
GPRC1B GRM2_HUMAN Metabotropic glutamate receptor mGlu2 | metabotropic glutamate 2
Type:
Enzyme
Mol. Mass.:
95584.88
Organism:
Homo sapiens (Human)
Description:
Q14416
Residue:
872
  
Inhibitor
Name:
BDBM466955
Synonyms:
8-chloro-3-((2,2-difluorocyclopropyl) methyl)-7-(4-fluoro-2-methylphenyl)- [1,2,4]triazole[4,3-a]pyridine | US10800776, Example 41
Type:
Small organic molecule
Emp. Form.:
C17H13ClF3N3
Mol. Mass.:
351.753
SMILES:
Cc1cc(F)ccc1-c1ccn2c(CC3CC3(F)F)nnc2c1Cl
: