Target
Metabotropic glutamate receptor 2
Ligand
BDBM50130608
Substrate
Meas. Tech.
In Vitro Activity Test for mGluR2
EC50
230±n/a nM
Citation
 Liu, HZhou, YXia, WZhang, DJiang, HChen, K Fluorine-containing triazolopyridine, and manufacturing method, pharmaceutical composition, and application thereof US Patent  US10800776 Publication Date 10/13/2020 
Target
Name:
Metabotropic glutamate receptor 2
Synonyms:
GPRC1B GRM2_HUMAN Metabotropic glutamate receptor mGlu2 | metabotropic glutamate 2
Type:
Enzyme
Mol. Mass.:
95584.88
Organism:
Homo sapiens (Human)
Description:
Q14416
Residue:
872
  
Inhibitor
Name:
BDBM50130608
Synonyms:
2,2,2-Trifluoro-ethanesulfonic acid [4-(2-methoxy-phenoxy)-phenyl]-pyridin-3-ylmethyl-amide LY-487379 | US10800776, Example LY487379
Type:
Small organic molecule
Emp. Form.:
C21H19F3N2O4S
Mol. Mass.:
452.447
SMILES:
COc1ccccc1Oc1ccc(cc1)N(Cc1cccnc1)S(=O)(=O)CC(F)(F)F
: