Target
Potassium voltage-gated channel subfamily H member 2
Ligand
BDBM466944
Substrate
Meas. Tech.
hERG Potassium Channel Toxicity Assay
IC50
31880±n/a nM
Citation
 Liu, HZhou, YXia, WZhang, DJiang, HChen, K Fluorine-containing triazolopyridine, and manufacturing method, pharmaceutical composition, and application thereof US Patent  US10800776 Publication Date 10/13/2020 
Target
Name:
Potassium voltage-gated channel subfamily H member 2
Synonyms:
1,3-beta-glucan synthase component GLS2 ERG Eag-related protein 1 Ether-a-go-go-related gene (HERG) Ether-a-go-go-related gene potassium channel 1 Ether-a-go-go-related gene potassium channel 1 (hERG1) Ether-a-go-go-related protein 1 H-ERG KCNH2 Potassium voltage-gated channel subfamily H member 2 (hERG) Voltage-gated potassium channel subunit Kv11.1 hERG Potassium Channel 1 | putative potassium channel subunit
Type:
Multi-pass membrane protein
Mol. Mass.:
126672.65
Organism:
Homo sapiens (Human)
Description:
Q12809
Residue:
1159
  
Inhibitor
Name:
BDBM466944
Synonyms:
2-(4-(3-((2,2-difluorocyclopropyl) methyl)-[1,2,4]triazole[4,3-a] pyridin-7-yl)phenyl)propan-2-ol | US10800776, Example 21
Type:
Small organic molecule
Emp. Form.:
C19H19F2N3O
Mol. Mass.:
343.3705
SMILES:
CC(C)(O)c1ccc(cc1)-c1ccn2c(CC3CC3(F)F)nnc2c1
: